{"text_format":"1","workbook":"xlsx","n_sheets":10,"sheets":["1. Info","2. Table of Contents","3. Rate Classes","4. RRR Data","5. UTRs and Sub-Transmission","6. Historical Wholesale","7. Current Wholesale","8. Forecast Wholesale","9. RTSR Rates to Forecast","hidden1"],"not_rendered":{"charts":0,"images":3,"macros":1,"external_links":2,"defined_names":20,"comments":0,"pivot_tables":0},"unopened":[],"bounds":{"document_bytes":16777216,"sheet_cells":100000,"rows_first":2000,"rows_last":500,"rows_between":2000,"halvings":0,"cell_chars":16384,"cell_head_chars":4096},"cells_cut":0,"cells_raw":0,"read":"whole","date_system":"1900"}

{"sheet":"1. Info","index":0,"n_rows":76,"n_cols":28,"rows_kept":76,"cut":false,"hidden":false,"merged":[[24,3,24,4],[20,3,20,4],[1,2,1,9],[2,2,2,9],[3,2,3,9],[4,2,4,9],[14,3,14,4],[16,3,16,4]]}
[null,null,null,null,null,null,null,null,null,null,null,null,null,null,null,null,null,null,null,null,null,null,null,null,null,null,null,"Alectra Utilities Corporation - Enersource Hydro"]
[null,null,null,null,null,null,null,null,null,null,null,null,null,null,null,null,null,null,null,null,null,null,null,null,null,null,null,"Alectra Utilities Corporation - Horizon Utilities"]
[null,null,null,null,null,null,null,null,null,null,null,null,null,null,null,null,null,null,null,null,null,null,null,null,null,null,null,"Alectra Utilities Corporation - Hydro One Brampton "]
[null,null,null,null,null,null,null,null,null,null,null,null,null,null,null,null,null,null,null,null,null,null,null,null,null,null,null,"Alectra Utilities Corporation - PowerStream Inc."]
[null,null,null,null,null,null,null,null,null,null,null,null,null,null,null,null,null,null,null,null,null,null,null,null,null,null,null,"Algoma Power Inc."]
[null,null,null,null,null,null,null,null,null,null,null,null,null,null,null,null,null,null,null,null,null,null,null,null,null,null,null,"Atikokan Hydro Inc."]
[null,null,null,null,null,null,null,null,null,null,null,null,null,null,null,null,null,null,null,null,null,null,null,null,null,null,null,"Attawapiskat Power Corp. "]
[null,null,null,null,null,null,null,null,null,null,null,null,null,null,null,null,null,null,null,null,null,null,null,null,null,null,null,"Bluewater Power Distribution Corporation"]
[null,null,null,null,null,null,null,null,null,null,null,null,null,null,null,null,null,null,null,null,null,null,null,null,null,null,null,"Brantford Power Inc."]
[null,null,null,null,null,null,null,null,null,null,null,null,null,null,null,null,null,null,null,null,null,null,null,null,null,null,null,"Burlington Hydro Inc."]
[null,null,null,null,null,null,null,null,null,null,null,null,null,null,null,null,null,null,null,null,null,null,null,null,null,null,null,"Canadian Niagara Power Inc."]
[null,null,null,null,null,null,null,null,null,null,null,null,null,null,null,null,null,null,null,null,null,null,null,null,null,null,null,"Centre Wellington Hydro Ltd."]
["Drop-down lists are shaded blue; Input cells are shaded green.",null,null,null,null,null,null,null,null,null,null,null,null,null,null,null,null,null,null,null,null,null,null,null,null,null,null,"Chapleau Public Utilities Corporation"]
[null,null,null,null,null,null,null,null,null,null,null,null,null,null,null,null,null,null,null,null,null,null,null,null,null,null,null,"Clinton Power Corporation"]
[null,null,"Utility Name   ","Hydro Ottawa Limited",null,null,null,null,null,null,null,null,null,null,null,null,null,null,null,null,null,null,null,null,null,null,null,"COLLUS PowerStream Corporation"]
[null,null,null,null,null,null,null,null,null,null,null,null,null,null,null,null,null,null,null,null,null,null,null,null,null,null,null,"Cooperative Hydro Embrun Inc."]
[null,null,"Service Territory","Ottawa, ON",null,null,null,null,null,null,null,null,null,null,null,null,null,null,null,null,null,null,null,null,null,null,null,"E.L.K. Energy Inc."]
[null,null,null,null,null,null,null,null,null,null,null,null,null,null,null,null,null,null,null,null,null,null,null,null,null,null,null,"Energy + Inc."]
[null,null,"Assigned EB Number","EB-2017-0052",null,null,null,null,null,null,null,null,null,null,null,null,null,null,null,null,null,null,null,null,null,null,null,"Entegrus Powerlines Inc."]
[null,null,null,null,null,null,null,null,null,null,null,null,null,null,null,null,null,null,null,null,null,null,null,null,null,null,null,"ENWIN Utilities Ltd."]
[null,null,"Name and Title","Aprile Barrie, Manager, Rates & Revenue",null,null,null,null,null,null,null,null,null,null,null,null,null,null,null,null,null,null,null,null,null,null,null,"Erie Thames Powerlines Corporation"]
[null,null,null,null,null,null,null,null,null,null,null,null,null,null,null,null,null,null,null,null,null,null,null,null,null,null,null,"Espanola Regional Hydro Distribution Corporation"]
[null,null,"Phone Number","613-738-5499, ext 2106",null,null,null,null,null,null,null,null,null,null,null,null,null,null,null,null,null,null,null,null,null,null,null,"Essex Powerlines Corporation"]
[null,null,null,null,null,null,null,null,null,null,null,null,null,null,null,null,null,null,null,null,null,null,null,null,null,null,null,"Festival Hydro Inc."]
[null,null,"Email Address","RegulatoryAffairs@HydroOttawa.com",null,null,null,null,null,null,null,null,null,null,null,null,null,null,null,null,null,null,null,null,null,null,null,"Fort Albany Power Corporation"]
[null,null,null,null,null,null,null,null,null,null,null,null,null,null,null,null,null,null,null,null,null,null,null,null,null,null,null,"Fort Frances Power Corporation"]
[null,null,"Date","Original",null,null,null,null,null,null,null,null,null,null,null,null,null,null,null,null,null,null,null,null,null,null,null,"Greater Sudbury Hydro Inc."]
[null,null,null,null,null,null,null,null,null,null,null,null,null,null,null,null,null,null,null,null,null,null,null,null,null,null,null,"Grimsby Power Inc."]
[null,null,"Last COS Re-based Year",2016,null,null,null,null,null,null,null,null,null,null,null,null,null,null,null,null,null,null,null,null,null,null,null,"Guelph Hydro Electric Systems Inc."]
[null,null,null,null,null,null,null,null,null,null,null,null,null,null,null,null,null,null,null,null,null,null,null,null,null,null,null,"Halton Hills Hydro Inc."]
{"$rows_left_out":47}
{"sheet":"2. Table of Contents","index":1,"n_rows":28,"n_cols":9,"rows_kept":28,"cut":false,"hidden":false,"merged":[]}
[]
[]
[]
[]
[]
[]
[]
[]
[]
[]
[]
[]
[]
[]
[]
[]
[]
[]
[]
[null,null,null,"1. Info",null,null,null,null,"6. Historical Wholesale"]
[]
[null,null,null,"2. Table of Contents",null,null,null,null,"7. Current Wholesale"]
[]
[null,null,null,"3. Rate Classes",null,null,null,null,"8. Forecast Wholesale"]
[]
[null,null,null,"4. RRR Data",null,null,null,null,"9. RTSR Rates to Forecast"]
[]
[null,null,null,"5. UTRs and Sub-Transmission"]

{"sheet":"3. Rate Classes","index":2,"n_rows":100,"n_cols":23,"rows_kept":100,"cut":false,"hidden":false,"merged":[[12,2,12,8]]}
[]
[]
[]
[]
[]
[]
[]
[]
[]
[]
[]
[]
[null,null,"1.  Select the appropriate rate classes that appear on your most recent Board-Approved Tariff of Rates and Charges.\n2.  Enter the RTS Network and Connection Rate as it appears on the Tariff of Rates and Charges"]
[]
[null,null,"Rate Class",null,"Unit",null,"RTSR-Network",null,"RTSR-Connection"]
[]
[null,null,"Residential",null,"kWh",null,7.4000000000000003E-3,null,4.7000000000000002E-3,null,null,{"$f":"IF(OR(ISBLANK(C17), ISERROR(FIND(\"Choose\", C17))=FALSE), 0, 1)","v":1},{"$f":"\"C\" & ROW(C17)","v":"C17"},{"$f":"IF(OR(C17=\"General Service Intermediate Rate Class 1,000 To 4,999 kW (formerly General Service > 50 kW Customers)\", C17=\"General Service Intermediate Rate Class 1,000 To 4,999 kW (formerly Large Use Customers)\"), \"x\", \"\")","v":""},null,null,null,null,null,null,null,null,"Choose Rate Class"]
[null,null,"General Service Less Than 50 kW",null,"kWh",null,6.7999999999999996E-3,null,4.4999999999999997E-3,null,null,1,"C18",{"$f":"IF(OR(C18=\"General Service Intermediate Rate Class 1,000 To 4,999 kW (formerly General Service > 50 kW Customers)\", C18=\"General Service Intermediate Rate Class 1,000 To 4,999 kW (formerly Large Use Customers)\"), \"x\", \"\")","v":""},null,null,null,null,null,null,null,null,"Residential"]
[null,null,"General Service 50 to 1,499 kW",null,"kW",null,2.8016000000000001,null,1.8173999999999999,null,null,1,"C19","",null,null,null,null,null,null,null,null,"Residential Regular"]
[null,null,"General Service 1,500 to 4,999 kW",null,"kW",null,2.9089,null,1.9422999999999999,null,null,1,"C20","",null,null,null,null,null,null,null,null,"Residential Urban"]
[null,null,"Large Use > 5000 kW",null,"kW",null,3.2246000000000001,null,2.1873,null,null,1,"C21","",null,null,null,null,null,null,null,null,"Residential Urban Year-Round"]
[null,null,"Unmetered Scattered Load",null,"kWh",null,6.7999999999999996E-3,null,4.4999999999999997E-3,null,null,1,"C22","",null,null,null,null,null,null,null,null,"Residential Suburban"]
[null,null,"Sentinel Lighting",null,"kW",null,2.0680999999999998,null,1.3501000000000001,null,null,1,"C23","",null,null,null,null,null,null,null,null,"Residential Suburban Seasonal"]
[null,null,"Street Lighting",null,"kW",null,2.0785999999999998,null,1.3783000000000001,null,null,1,"C24","",null,null,null,null,null,null,null,null,"Residential Suburban Year Round"]
[null,null,"Choose Rate Class",null,null,null,null,null,null,null,null,0,"C25","",null,null,null,null,null,null,null,null,"Residential - Time of Use"]
[null,null,"Choose Rate Class",null,null,null,null,null,null,null,null,0,"C26","",null,null,null,null,null,null,null,null,"Residential - Hensall"]
[null,null,"Choose Rate Class",null,null,null,null,null,null,null,null,0,"C27","",null,null,null,null,null,null,null,null,"Residential – High Density [R1]"]
[null,null,"Choose Rate Class",null,null,null,null,null,null,null,null,0,"C28","",null,null,null,null,null,null,null,null,"Residential – Normal Density [R2]"]
[null,null,"Choose Rate Class",null,null,null,null,null,null,null,null,0,"C29","",null,null,null,null,null,null,null,null,"Seasonal Residential – High Density [R3]"]
[null,null,"Choose Rate Class",null,null,null,null,null,null,null,null,0,"C30","",null,null,null,null,null,null,null,null,"Seasonal Residential – Normal Density [R4]"]
{"$rows_left_out":71}
{"sheet":"4. RRR Data","index":3,"n_rows":32,"n_cols":9,"rows_kept":32,"cut":false,"hidden":false,"merged":[[12,1,12,8]]}
[]
[]
[]
[]
[]
[]
[]
[]
[]
[]
[]
[]
[]
[]
[null,"Rate Class","Rate Description","Unit","Rate","Non-Loss Adjusted Metered kWh","Non-Loss Adjusted Metered kW","Applicable \nLoss Factor\neg: (1.0325)","Loss Adjusted Billed kWh"]
[]
[null,"Residential","RTSR - Network","kWh",7.4000000000000003E-3,2260335626,null,1.0335000000000001,{"$f":"F17*H17","v":2336056869.4710002}]
[null,"Residential","RTSR - Connection","kWh",4.7000000000000002E-3,2260335626,null,1.0335000000000001,{"$f":"F18*H18","v":2336056869.4710002}]
[null,"General Service Less Than 50 kW","RTSR - Network","kWh",6.7999999999999996E-3,733311565,null,1.0335000000000001,{"$f":"F19*H19","v":757877502.42750001}]
[null,"General Service Less Than 50 kW","RTSR - Connection","kWh",4.4999999999999997E-3,733311565,null,1.0335000000000001,{"$f":"F20*H20","v":757877502.42750001}]
[null,"General Service 50 to 1,499 kW","RTSR - Network","kW",2.8016000000000001,2958900805,7075314]
[null,"General Service 50 to 1,499 kW","RTSR - Connection","kW",1.8173999999999999,2958900805,7075314]
[null,"General Service 1,500 to 4,999 kW","RTSR - Network","kW",2.9089,805583761,1726981]
[null,"General Service 1,500 to 4,999 kW","RTSR - Connection","kW",1.9422999999999999,805583761,1726981]
[null,"Large Use > 5000 kW","RTSR - Network","kW",3.2246000000000001,588872536,1071626]
[null,"Large Use > 5000 kW","RTSR - Connection","kW",2.1873,588872536,1071626]
[null,"Unmetered Scattered Load","RTSR - Network","kWh",6.7999999999999996E-3,15659015,null,1.0335000000000001,{"$f":"F27*H27","v":16183592.002500001}]
[null,"Unmetered Scattered Load","RTSR - Connection","kWh",4.4999999999999997E-3,15659015,null,1.0335000000000001,{"$f":"F28*H28","v":16183592.002500001}]
[null,"Sentinel Lighting","RTSR - Network","kW",2.0680999999999998,48064,134]
[null,"Sentinel Lighting","RTSR - Connection","kW",1.3501000000000001,48064,134]
{"$rows_left_out":3}
{"sheet":"5. UTRs and Sub-Transmission","index":4,"n_rows":75,"n_cols":10,"rows_kept":75,"cut":false,"hidden":false,"merged":[[48,4,48,5],[44,4,44,5],[59,4,59,5],[28,4,28,5],[17,4,17,5],[33,4,33,5],[19,4,19,5],[21,4,21,5],[23,4,23,5],[25,4,25,5],[69,4,69,5],[71,4,71,5],[74,4,74,5],[73,4,73,5],[50,4,50,5],[52,4,52,5],[54,4,54,5],[56,4,56,5],[65,4,65,5],[67,4,67,5]]}
[]
[]
[]
[]
[]
[]
[]
[]
[]
[]
[]
[]
[]
[]
[]
[]
[]
[null,"Uniform Transmission Rates","Unit",null,2016,null,null,2017,null,2018]
[]
[null,"Rate Description",null,null,"Rate",null,null,"Rate",null,"Rate"]
[]
[null,"Network Service Rate","kW",null,3.66,null,null,3.66,null,3.66]
[]
[null,"Line Connection Service Rate","kW",null,0.87,null,null,0.87,null,0.87]
[]
[null,"Transformation Connection Service Rate","kW",null,2.02,null,null,2.02,null,2.02]
[]
[]
[null,"Hydro One Sub-Transmission Rates","Unit",null,2016,null,null,2017,null,2018]
[null,null,null,null,"Jan 2016","Feb - Dec 2016"]
{"$rows_left_out":46}
{"sheet":"6. Historical Wholesale","index":5,"n_rows":117,"n_cols":16,"rows_kept":117,"cut":false,"hidden":false,"merged":[[20,3,20,5],[20,7,20,9],[20,11,20,13],[96,3,96,5],[38,3,38,5],[38,7,38,9],[38,11,38,13],[95,3,95,5],[57,3,57,5],[57,7,57,9],[57,11,57,13],[76,3,76,5],[76,7,76,9],[76,11,76,13],[95,7,95,9],[95,11,95,13],[96,7,96,9],[96,11,96,13]]}
[]
[]
[]
[]
[]
[]
[]
[]
[]
[]
[]
[]
[]
[]
[]
[]
[]
[]
[]
[]
[null,"IESO",null,"Network",null,null,null,"Line Connection",null,null,null,"Transformation Connection",null,null,null,"Total Line"]
[null,"Month",null,"Units Billed","Rate","Amount",null,"Units Billed","Rate","Amount",null,"Units Billed","Rate","Amount",null,"Amount"]
[]
[null,"January",null,1110525,3.66,4064522,null,1106094,0.87,962302,null,857995,2.02,1733150,null,{"$f":"J24+N24","v":2695452}]
[null,"February",null,1109379,3.66,4060327,null,1124912,0.87,978673,null,863642,2.02,1744557,null,2723230]
[null,"March",null,1055936,3.66,3864726,null,1054578,0.87,917483,null,789894,2.02,1595586,null,2513069]
[null,"April",null,960122,3.66,3514047,null,960667,0.87,835780,null,738832,2.02,1492441,null,2328221]
[null,"May",null,1202297,3.66,4400407,null,1186974,0.87,1032667,null,920214,2.02,1858832,null,2891499]
[null,"June",null,1303928,3.66,4772376,null,1272908,0.87,1107430,null,918915,2.02,1856208,null,2963638]
[null,"July",null,1289467,3.66,4719449,null,1278103,0.87,1111950,null,940665,2.02,1900143,null,3012093]
{"$rows_left_out":88}
{"sheet":"7. Current Wholesale","index":6,"n_rows":117,"n_cols":16,"rows_kept":117,"cut":false,"hidden":false,"merged":[[12,1,12,11],[19,3,19,5],[19,7,19,9],[19,11,19,13],[38,3,38,5],[38,7,38,9],[38,11,38,13],[96,7,96,9],[96,11,96,13],[20,3,20,5],[20,7,20,9],[20,11,20,13],[96,3,96,5],[95,3,95,5],[95,7,95,9],[95,11,95,13],[57,3,57,5],[57,7,57,9],[57,11,57,13],[76,3,76,5],[76,7,76,9],[76,11,76,13]]}
[]
[]
[]
[]
[]
[]
[]
[]
[]
[]
[]
[]
[null,"The purpose of this sheet is to calculate the expected billing when current 2017 Uniform Transmission Rates are applied against historical 2016 transmission units."]
[]
[]
[]
[]
[]
[]
[null,"IESO",null,"Network",null,null,null,"Line Connection",null,null,null,"Transformation Connection",null,null,null,"Total Line"]
[]
[null,"Month",null,"Units Billed","Rate","Amount",null,"Units Billed","Rate","Amount",null,"Units Billed","Rate","Amount",null,"Amount"]
[]
[null,"January",null,{"$f":"'6. Historical Wholesale'!D24","v":1110525},{"$f":"'5. UTRs and Sub-Transmission'!H22","v":3.66},{"$f":"D24*E24","v":4064521.5},null,{"$f":"'6. Historical Wholesale'!H24","v":1106094},{"$f":"'5. UTRs and Sub-Transmission'!H24","v":0.87},{"$f":"H24*I24","v":962301.78},null,{"$f":"'6. Historical Wholesale'!L24","v":857995},{"$f":"'5. UTRs and Sub-Transmission'!H26","v":2.02},{"$f":"L24*M24","v":1733149.9},null,{"$f":"J24+N24","v":2695451.6799999997}]
[null,"February",null,{"$f":"'6. Historical Wholesale'!D25","v":1109379},{"$f":"E24","v":3.66},{"$f":"D25*E25","v":4060327.14},null,{"$f":"'6. Historical Wholesale'!H25","v":1124912},{"$f":"I24","v":0.87},{"$f":"H25*I25","v":978673.44},null,{"$f":"'6. Historical Wholesale'!L25","v":863642},{"$f":"M24","v":2.02},{"$f":"L25*M25","v":1744556.84},null,2723230.2800000003]
[null,"March",null,{"$f":"'6. Historical Wholesale'!D26","v":1055936},{"$f":"E25","v":3.66},3864725.7600000002,null,{"$f":"'6. Historical Wholesale'!H26","v":1054578},{"$f":"I25","v":0.87},917482.86,null,{"$f":"'6. Historical Wholesale'!L26","v":789894},{"$f":"M25","v":2.02},1595585.8800000001,null,2513068.7400000002]
[null,"April",null,{"$f":"'6. Historical Wholesale'!D27","v":960122},3.66,3514046.52,null,{"$f":"'6. Historical Wholesale'!H27","v":960667},0.87,835780.29,null,{"$f":"'6. Historical Wholesale'!L27","v":738832},2.02,1492440.64,null,2328220.9299999997]
[null,"May",null,{"$f":"'6. Historical Wholesale'!D28","v":1202297},3.66,4400407.0200000005,null,{"$f":"'6. Historical Wholesale'!H28","v":1186974},0.87,1032667.38,null,{"$f":"'6. Historical Wholesale'!L28","v":920214},2.02,1858832.28,null,2891499.66]
[null,"June",null,{"$f":"'6. Historical Wholesale'!D29","v":1303928},3.66,4772376.4800000004,null,{"$f":"'6. Historical Wholesale'!H29","v":1272908},0.87,1107429.96,null,{"$f":"'6. Historical Wholesale'!L29","v":918915},2.02,1856208.3,null,2963638.26]
[null,"July",null,{"$f":"'6. Historical Wholesale'!D30","v":1289467},3.66,4719449.22,null,{"$f":"'6. Historical Wholesale'!H30","v":1278103},0.87,1111949.6100000001,null,{"$f":"'6. Historical Wholesale'!L30","v":940665},2.02,1900143.3,null,3012092.91]
{"$rows_left_out":88}
{"sheet":"8. Forecast Wholesale","index":7,"n_rows":117,"n_cols":16,"rows_kept":117,"cut":false,"hidden":false,"merged":[[12,1,12,12],[19,3,19,5],[19,7,19,9],[19,11,19,13],[38,3,38,5],[38,7,38,9],[38,11,38,13],[96,7,96,9],[96,11,96,13],[20,3,20,5],[20,7,20,9],[20,11,20,13],[96,3,96,5],[95,3,95,5],[95,7,95,9],[95,11,95,13],[57,3,57,5],[57,7,57,9],[57,11,57,13],[76,3,76,5],[76,7,76,9],[76,11,76,13]]}
[]
[]
[]
[]
[]
[]
[]
[]
[]
[]
[]
[]
[null,"The purpose of this sheet is to calculate the expected billing when forecasted 2018 Uniform Transmission Rates are applied against historical 2016 transmission units."]
[]
[]
[]
[]
[]
[]
[null,"IESO",null,"Network",null,null,null,"Line Connection",null,null,null,"Transformation Connection",null,null,null,"Total Line"]
[]
[null,"Month",null,"Units Billed","Rate","Amount",null,"Units Billed","Rate","Amount",null,"Units Billed","Rate","Amount",null,"Amount"]
[]
[null,"January",null,{"$f":"'6. Historical Wholesale'!D24","v":1110525},{"$f":"'5. UTRs and Sub-Transmission'!J22","v":3.66},{"$f":"D24*E24","v":4064521.5},null,{"$f":"'6. Historical Wholesale'!H24","v":1106094},{"$f":"'5. UTRs and Sub-Transmission'!J24","v":0.87},{"$f":"H24*I24","v":962301.78},null,{"$f":"'6. Historical Wholesale'!L24","v":857995},{"$f":"'5. UTRs and Sub-Transmission'!J26","v":2.02},{"$f":"L24*M24","v":1733149.9},null,{"$f":"J24+N24","v":2695451.6799999997}]
[null,"February",null,{"$f":"'6. Historical Wholesale'!D25","v":1109379},{"$f":"E24","v":3.66},4060327.14,null,{"$f":"'6. Historical Wholesale'!H25","v":1124912},{"$f":"I24","v":0.87},978673.44,null,{"$f":"'6. Historical Wholesale'!L25","v":863642},{"$f":"M24","v":2.02},1744556.84,null,2723230.2800000003]
[null,"March",null,{"$f":"'6. Historical Wholesale'!D26","v":1055936},3.66,3864725.7600000002,null,{"$f":"'6. Historical Wholesale'!H26","v":1054578},0.87,917482.86,null,{"$f":"'6. Historical Wholesale'!L26","v":789894},2.02,1595585.8800000001,null,2513068.7400000002]
[null,"April",null,{"$f":"'6. Historical Wholesale'!D27","v":960122},3.66,3514046.52,null,{"$f":"'6. Historical Wholesale'!H27","v":960667},0.87,835780.29,null,{"$f":"'6. Historical Wholesale'!L27","v":738832},2.02,1492440.64,null,2328220.9299999997]
[null,"May",null,{"$f":"'6. Historical Wholesale'!D28","v":1202297},3.66,4400407.0200000005,null,{"$f":"'6. Historical Wholesale'!H28","v":1186974},0.87,1032667.38,null,{"$f":"'6. Historical Wholesale'!L28","v":920214},2.02,1858832.28,null,2891499.66]
[null,"June",null,{"$f":"'6. Historical Wholesale'!D29","v":1303928},3.66,4772376.4800000004,null,{"$f":"'6. Historical Wholesale'!H29","v":1272908},0.87,1107429.96,null,{"$f":"'6. Historical Wholesale'!L29","v":918915},2.02,1856208.3,null,2963638.26]
[null,"July",null,{"$f":"'6. Historical Wholesale'!D30","v":1289467},3.66,4719449.22,null,{"$f":"'6. Historical Wholesale'!H30","v":1278103},0.87,1111949.6100000001,null,{"$f":"'6. Historical Wholesale'!L30","v":940665},2.02,1900143.3,null,3012092.91]
{"$rows_left_out":88}
{"sheet":"9. RTSR Rates to Forecast","index":8,"n_rows":60,"n_cols":10,"rows_kept":60,"cut":false,"hidden":false,"merged":[]}
[]
[]
[]
[]
[]
[]
[]
[]
[]
[]
[]
[]
["The purpose of this sheet is to re-align the current RTS Network Rates to recover current wholesale network costs."]
[]
["Rate Class","Rate Description","Unit","Current RTSR-Network","Loss Adjusted Billed kWh","Billed kW","Billed Amount","Billed Amount %","Current Wholesale Billing","Adjusted RTSR Network"]
[]
["Residential","RTSR - Network","kWh",7.4000000000000003E-3,2336056869.4710002,null,{"$f":"ROUND(D17*E17, 2)","v":17286820.829999998},{"$f":"G17/51112880.73","v":0.33820869775108836},{"$f":"H17*total_current_wholesale_network","v":17568659.743639417},{"$f":"IF(ISERROR(I17/E17), 0, I17/E17)","v":7.5206472809961336E-3}]
["General Service Less Than 50 kW","RTSR - Network","kWh",6.7999999999999996E-3,757877502.42750001,null,{"$f":"ROUND(D18*E18, 2)","v":5153567.0199999996},0.10082716815010555,5237589.1629127134,{"$f":"IF(ISERROR(I18/E18), 0, I18/E18)","v":6.9108650753407887E-3}]
["General Service 50 to 1,499 kW","RTSR - Network","kW",2.8016000000000001,null,7075314,{"$f":"ROUND(D19*F19, 2)","v":19822199.699999999},0.38781221909031699,20145374.636810612,{"$f":"IF(ISERROR(I19/F19), 0, I19/F19)","v":2.8472764087658318}]
["General Service 1,500 to 4,999 kW","RTSR - Network","kW",2.9089,null,1726981,{"$f":"ROUND(D20*F20, 2)","v":5023615.03},9.8284717242545463E-2,5105518.4763607541,{"$f":"IF(ISERROR(I20/F20), 0, I20/F20)","v":2.9563257941811485}]
["Large Use > 5000 kW","RTSR - Network","kW",3.2246000000000001,null,1071626,{"$f":"ROUND(D21*F21, 2)","v":3455565.2},6.760654360793647E-2,3511903.652949546,{"$f":"IF(ISERROR(I21/F21), 0, I21/F21)","v":3.2771728690322428}]
["Unmetered Scattered Load","RTSR - Network","kWh",6.7999999999999996E-3,16183592.002500001,null,{"$f":"ROUND(D22*E22, 2)","v":110048.43},2.1530469116253234E-3,111842.62514229579,{"$f":"IF(ISERROR(I22/E22), 0, I22/E22)","v":6.9108653459021094E-3}]
["Sentinel Lighting","RTSR - Network","kW",2.0680999999999998,null,134,{"$f":"ROUND(D23*F23, 2)","v":277.13},5.4219209726002075E-6,281.64824073986728,{"$f":"IF(ISERROR(I23/F23), 0, I23/F23)","v":2.1018525428348305}]
["Street Lighting","RTSR - Network","kW",2.0785999999999998,null,125463,{"$f":"ROUND(D24*F24, 2)","v":260787.39},5.1021853254092659E-3,265039.18594393122,{"$f":"IF(ISERROR(I24/F24), 0, I24/F24)","v":2.1124888289290964}]
[]
["The purpose of this table is to re-align the current RTS Connection Rates to recover current wholesale connection costs."]
["Rate Class","Rate Description","Unit","Current RTSR-Connection","Loss Adjusted Billed kWh","Billed kW","Billed Amount","Billed Amount %","Current Wholesale Billing","Adjusted RTSR-Connection"]
[]
["Residential","RTSR - Connection","kWh",4.7000000000000002E-3,2336056869.4710002,null,{"$f":"ROUND(D29*E29, 2)","v":10979467.289999999},{"$f":"G29/33192807.18","v":0.33077850964698069},{"$f":"H29*Total_Current_Wholesale_Lineplus","v":11120236.123968912},{"$f":"IF(ISERROR(I29/E29), 0, I29/E29)","v":4.7602591654744642E-3}]
["General Service Less Than 50 kW","RTSR - Connection","kWh",4.4999999999999997E-3,757877502.42750001,null,{"$f":"ROUND(D30*E30, 2)","v":3410448.76},0.10274662042006896,3454174.4602161823,{"$f":"IF(ISERROR(I30/E30), 0, I30/E30)","v":4.5576949429853479E-3}]
{"$rows_left_out":31}
{"sheet":"hidden1","index":9,"n_rows":22,"n_cols":2,"rows_kept":22,"cut":false,"hidden":true,"merged":[]}
[{"$f":"IF('3. Rate Classes'!L17=1, '3. Rate Classes'!C17, \"\")","v":"Residential"},1]
[{"$f":"IF('3. Rate Classes'!L18=1, '3. Rate Classes'!C18, \"\")","v":"General Service Less Than 50 kW"},2]
[{"$f":"IF('3. Rate Classes'!L19=1, '3. Rate Classes'!C19, \"\")","v":"General Service 50 to 1,499 kW"},3]
[{"$f":"IF('3. Rate Classes'!L20=1, '3. Rate Classes'!C20, \"\")","v":"General Service 1,500 to 4,999 kW"},4]
[{"$f":"IF('3. Rate Classes'!L21=1, '3. Rate Classes'!C21, \"\")","v":"Large Use > 5000 kW"},5]
[{"$f":"IF('3. Rate Classes'!L22=1, '3. Rate Classes'!C22, \"\")","v":"Unmetered Scattered Load"},6]
[{"$f":"IF('3. Rate Classes'!L23=1, '3. Rate Classes'!C23, \"\")","v":"Sentinel Lighting"},7]
[{"$f":"IF('3. Rate Classes'!L24=1, '3. Rate Classes'!C24, \"\")","v":"Street Lighting"},8]
[{"$f":"IF('3. Rate Classes'!L25=1, '3. Rate Classes'!C25, \"\")","v":""},9]
[{"$f":"IF('3. Rate Classes'!L26=1, '3. Rate Classes'!C26, \"\")","v":""},10]
[{"$f":"IF('3. Rate Classes'!L27=1, '3. Rate Classes'!C27, \"\")","v":""},11]
[{"$f":"IF('3. Rate Classes'!L28=1, '3. Rate Classes'!C28, \"\")","v":""},12]
[{"$f":"IF('3. Rate Classes'!L29=1, '3. Rate Classes'!C29, \"\")","v":""},13]
[{"$f":"IF('3. Rate Classes'!L30=1, '3. Rate Classes'!C30, \"\")","v":""},14]
[{"$f":"IF('3. Rate Classes'!L31=1, '3. Rate Classes'!C31, \"\")","v":""},15]
[{"$f":"IF('3. Rate Classes'!L32=1, '3. Rate Classes'!C32, \"\")","v":""},16]
[{"$f":"IF('3. Rate Classes'!L33=1, '3. Rate Classes'!C33, \"\")","v":""},17]
[{"$f":"IF('3. Rate Classes'!L34=1, '3. Rate Classes'!C34, \"\")","v":""},18]
[{"$f":"IF('3. Rate Classes'!L35=1, '3. Rate Classes'!C35, \"\")","v":""},19]
[{"$f":"IF('3. Rate Classes'!L36=1, '3. Rate Classes'!C36, \"\")","v":""},20]
[{"$f":"IF('3. Rate Classes'!L37=1, '3. Rate Classes'!C37, \"\")","v":""},21]
[{"$f":"IF('3. Rate Classes'!L38=1, '3. Rate Classes'!C38, \"\")","v":""},22]